{"text_format":"1","workbook":"xlsx","n_sheets":9,"sheets":["Menu","Área","Colab","Avaliação","Dash1","Dash2","Dash3","Instruções","Config"],"not_rendered":{"charts":0,"images":10,"macros":1,"external_links":0,"defined_names":12,"comments":0,"pivot_tables":0},"unopened":[],"bounds":{"document_bytes":16777216,"sheet_cells":100000,"rows_first":2000,"rows_last":500,"rows_between":2000,"halvings":0,"cell_chars":16384,"cell_head_chars":4096},"cells_cut":0,"cells_raw":0,"read":"whole","date_system":"1900"}

{"sheet":"Menu","index":0,"n_rows":26,"n_cols":7,"rows_kept":26,"cut":false,"hidden":false,"merged":[[25,4,25,5],[25,6,25,14]]}
[]
[]
[]
[]
[]
[]
[]
[]
[]
[]
[]
[]
[]
[]
[]
[]
[]
[]
[]
[]
[]
[]
[]
[]
[]
[null,null,null,null,"Empresa:",null,"Empresa ABCDE"]

{"sheet":"Área","index":1,"n_rows":16,"n_cols":6,"rows_kept":16,"cut":false,"hidden":false,"merged":[[9,2,9,3]]}
[]
[]
[]
[]
[]
[]
[]
[]
[]
[null,"Empresa:",{"$f":"Menu!G26","v":"Empresa ABCDE"}]
[]
[null,"Área\nInsira as áreas utilizadas na empresa.",null,null,null," "]
[null,"Área"]
[null,"Administrativo"]
[null,"Produção"]
[null,"Almoxarifado"]

{"sheet":"Colab","index":2,"n_rows":16,"n_cols":8,"rows_kept":16,"cut":false,"hidden":false,"merged":[[9,2,9,3],[11,1,11,7]]}
[]
[]
[]
[]
[]
[]
[]
[]
[]
[null,"Empresa:",{"$f":"Menu!G26","v":"Empresa ABCDE"}]
[]
[null,"CADASTRO DE COLABORADORES\nInsira os dados dos seus colaboradores."]
[null,"Colaborador","Área","Cargo","Salário","Escolaridade","Telefone","Endereço"]
[null,"José da Silva","Administrativo","Assistente Administrativo",1800,"Ensino Superior","9999-9999"]
[null,"João Alves","Produção","Auxiliar de PCP",1200,"Ensino Médio","8888-8888"]
[null,"Paulo Vitor","Almoxarifado","Almoxarife",1500,"Ensino Médio","7777-7777"]

{"sheet":"Avaliação","index":3,"n_rows":63,"n_cols":10,"rows_kept":63,"cut":false,"hidden":false,"merged":[[9,2,9,6],[11,1,11,6]]}
[]
[]
[]
[]
[]
[]
[]
[]
[]
[null,"Empresa:",{"$f":"Menu!G26","v":"Empresa ABCDE"}]
[]
[null,"AVALIALÇÃO NINE BOX\nInsira o desempenho e o potencial que melhor representa o colaborador."]
[null,"Colaborador","Área","Desempenho","Potencial","Classificação Nine Box","FeedBack",null,null,"Média"]
[null,{"$f":"Colab!B14","v":"José da Silva"},{"$f":"Colab!C14","v":"Administrativo"},"Esperado","Alto",{"$f":"IF(H14=\"-\",\"\",VLOOKUP(H14,Config!$A$1:$C$9,2,0))","v":"Forte Desempenho"},{"$f":"IF(H14=\"-\",\"\",VLOOKUP(H14,Config!$A$1:$C$9,3,0))","v":"Verificar se tem habilidades para administrar projetos a longo prazo."},{"$f":"CONCATENATE(D14,\"-\",E14)","v":"Esperado-Alto"},null,{"$f":"IFERROR(AVERAGEIF(C14:G14,\">0\"),\"\")","v":""}]
[null,{"$f":"Colab!B15","v":"João Alves"},{"$f":"Colab!C15","v":"Produção"},"Acima do esperado","Alto",{"$f":"IF(H15=\"-\",\"\",VLOOKUP(H15,Config!$A$1:$C$9,2,0))","v":"Alto Potencial"},{"$f":"IF(H15=\"-\",\"\",VLOOKUP(H15,Config!$A$1:$C$9,3,0))","v":"Grande potencial. Pode delegar mais responsabilidades."},{"$f":"CONCATENATE(D15,\"-\",E15)","v":"Acima do esperado-Alto"},null,""]
[null,{"$f":"Colab!B16","v":"Paulo Vitor"},{"$f":"Colab!C16","v":"Almoxarifado"},"Abaixo do esperado","Baixo",{"$f":"IF(H16=\"-\",\"\",VLOOKUP(H16,Config!$A$1:$C$9,2,0))","v":"Insuficiente"},{"$f":"IF(H16=\"-\",\"\",VLOOKUP(H16,Config!$A$1:$C$9,3,0))","v":"Função exigem mais que suas habilidades. Analisar demissão ou cargo de menor responsabilidades."},"Abaixo do esperado-Baixo",null,""]
[null,{"$f":"Colab!B17","v":0},{"$f":"Colab!C17","v":0},null,null,{"$f":"IF(H17=\"-\",\"\",VLOOKUP(H17,Config!$A$1:$C$9,2,0))","v":""},{"$f":"IF(H17=\"-\",\"\",VLOOKUP(H17,Config!$A$1:$C$9,3,0))","v":""},"-",null,""]
[null,{"$f":"Colab!B18","v":0},{"$f":"Colab!C18","v":0},null,null,{"$f":"IF(H18=\"-\",\"\",VLOOKUP(H18,Config!$A$1:$C$9,2,0))","v":""},{"$f":"IF(H18=\"-\",\"\",VLOOKUP(H18,Config!$A$1:$C$9,3,0))","v":""},"-",null,""]
[null,{"$f":"Colab!B19","v":0},{"$f":"Colab!C19","v":0},null,null,{"$f":"IF(H19=\"-\",\"\",VLOOKUP(H19,Config!$A$1:$C$9,2,0))","v":""},{"$f":"IF(H19=\"-\",\"\",VLOOKUP(H19,Config!$A$1:$C$9,3,0))","v":""},"-",null,""]
[null,{"$f":"Colab!B20","v":0},{"$f":"Colab!C20","v":0},null,null,{"$f":"IF(H20=\"-\",\"\",VLOOKUP(H20,Config!$A$1:$C$9,2,0))","v":""},{"$f":"IF(H20=\"-\",\"\",VLOOKUP(H20,Config!$A$1:$C$9,3,0))","v":""},"-",null,""]
[null,{"$f":"Colab!B21","v":0},{"$f":"Colab!C21","v":0},null,null,{"$f":"IF(H21=\"-\",\"\",VLOOKUP(H21,Config!$A$1:$C$9,2,0))","v":""},{"$f":"IF(H21=\"-\",\"\",VLOOKUP(H21,Config!$A$1:$C$9,3,0))","v":""},"-",null,""]
[null,{"$f":"Colab!B22","v":0},{"$f":"Colab!C22","v":0},null,null,{"$f":"IF(H22=\"-\",\"\",VLOOKUP(H22,Config!$A$1:$C$9,2,0))","v":""},{"$f":"IF(H22=\"-\",\"\",VLOOKUP(H22,Config!$A$1:$C$9,3,0))","v":""},"-",null,""]
[null,{"$f":"Colab!B23","v":0},{"$f":"Colab!C23","v":0},null,null,{"$f":"IF(H23=\"-\",\"\",VLOOKUP(H23,Config!$A$1:$C$9,2,0))","v":""},{"$f":"IF(H23=\"-\",\"\",VLOOKUP(H23,Config!$A$1:$C$9,3,0))","v":""},"-",null,""]
[null,{"$f":"Colab!B24","v":0},{"$f":"Colab!C24","v":0},null,null,{"$f":"IF(H24=\"-\",\"\",VLOOKUP(H24,Config!$A$1:$C$9,2,0))","v":""},{"$f":"IF(H24=\"-\",\"\",VLOOKUP(H24,Config!$A$1:$C$9,3,0))","v":""},"-",null,""]
[null,{"$f":"Colab!B25","v":0},{"$f":"Colab!C25","v":0},null,null,{"$f":"IF(H25=\"-\",\"\",VLOOKUP(H25,Config!$A$1:$C$9,2,0))","v":""},{"$f":"IF(H25=\"-\",\"\",VLOOKUP(H25,Config!$A$1:$C$9,3,0))","v":""},"-",null,""]
[null,{"$f":"Colab!B26","v":0},{"$f":"Colab!C26","v":0},null,null,{"$f":"IF(H26=\"-\",\"\",VLOOKUP(H26,Config!$A$1:$C$9,2,0))","v":""},{"$f":"IF(H26=\"-\",\"\",VLOOKUP(H26,Config!$A$1:$C$9,3,0))","v":""},"-",null,""]
[null,{"$f":"Colab!B27","v":0},{"$f":"Colab!C27","v":0},null,null,{"$f":"IF(H27=\"-\",\"\",VLOOKUP(H27,Config!$A$1:$C$9,2,0))","v":""},{"$f":"IF(H27=\"-\",\"\",VLOOKUP(H27,Config!$A$1:$C$9,3,0))","v":""},"-",null,""]
[null,{"$f":"Colab!B28","v":0},{"$f":"Colab!C28","v":0},null,null,{"$f":"IF(H28=\"-\",\"\",VLOOKUP(H28,Config!$A$1:$C$9,2,0))","v":""},{"$f":"IF(H28=\"-\",\"\",VLOOKUP(H28,Config!$A$1:$C$9,3,0))","v":""},"-",null,""]
[null,{"$f":"Colab!B29","v":0},{"$f":"Colab!C29","v":0},null,null,{"$f":"IF(H29=\"-\",\"\",VLOOKUP(H29,Config!$A$1:$C$9,2,0))","v":""},{"$f":"IF(H29=\"-\",\"\",VLOOKUP(H29,Config!$A$1:$C$9,3,0))","v":""},"-",null,""]
[null,{"$f":"Colab!B30","v":0},{"$f":"Colab!C30","v":0},null,null,{"$f":"IF(H30=\"-\",\"\",VLOOKUP(H30,Config!$A$1:$C$9,2,0))","v":""},{"$f":"IF(H30=\"-\",\"\",VLOOKUP(H30,Config!$A$1:$C$9,3,0))","v":""},"-",null,""]
[null,{"$f":"Colab!B31","v":0},{"$f":"Colab!C31","v":0},null,null,{"$f":"IF(H31=\"-\",\"\",VLOOKUP(H31,Config!$A$1:$C$9,2,0))","v":""},{"$f":"IF(H31=\"-\",\"\",VLOOKUP(H31,Config!$A$1:$C$9,3,0))","v":""},"-",null,""]
[null,{"$f":"Colab!B32","v":0},{"$f":"Colab!C32","v":0},null,null,{"$f":"IF(H32=\"-\",\"\",VLOOKUP(H32,Config!$A$1:$C$9,2,0))","v":""},{"$f":"IF(H32=\"-\",\"\",VLOOKUP(H32,Config!$A$1:$C$9,3,0))","v":""},"-",null,""]
[null,{"$f":"Colab!B33","v":0},{"$f":"Colab!C33","v":0},null,null,{"$f":"IF(H33=\"-\",\"\",VLOOKUP(H33,Config!$A$1:$C$9,2,0))","v":""},{"$f":"IF(H33=\"-\",\"\",VLOOKUP(H33,Config!$A$1:$C$9,3,0))","v":""},"-",null,""]
[null,{"$f":"Colab!B34","v":0},{"$f":"Colab!C34","v":0},null,null,{"$f":"IF(H34=\"-\",\"\",VLOOKUP(H34,Config!$A$1:$C$9,2,0))","v":""},{"$f":"IF(H34=\"-\",\"\",VLOOKUP(H34,Config!$A$1:$C$9,3,0))","v":""},"-",null,""]
[null,{"$f":"Colab!B35","v":0},{"$f":"Colab!C35","v":0},null,null,{"$f":"IF(H35=\"-\",\"\",VLOOKUP(H35,Config!$A$1:$C$9,2,0))","v":""},{"$f":"IF(H35=\"-\",\"\",VLOOKUP(H35,Config!$A$1:$C$9,3,0))","v":""},"-",null,""]
[null,{"$f":"Colab!B36","v":0},{"$f":"Colab!C36","v":0},null,null,{"$f":"IF(H36=\"-\",\"\",VLOOKUP(H36,Config!$A$1:$C$9,2,0))","v":""},{"$f":"IF(H36=\"-\",\"\",VLOOKUP(H36,Config!$A$1:$C$9,3,0))","v":""},"-",null,""]
[null,{"$f":"Colab!B37","v":0},{"$f":"Colab!C37","v":0},null,null,{"$f":"IF(H37=\"-\",\"\",VLOOKUP(H37,Config!$A$1:$C$9,2,0))","v":""},{"$f":"IF(H37=\"-\",\"\",VLOOKUP(H37,Config!$A$1:$C$9,3,0))","v":""},"-",null,""]
[null,{"$f":"Colab!B38","v":0},{"$f":"Colab!C38","v":0},null,null,{"$f":"IF(H38=\"-\",\"\",VLOOKUP(H38,Config!$A$1:$C$9,2,0))","v":""},{"$f":"IF(H38=\"-\",\"\",VLOOKUP(H38,Config!$A$1:$C$9,3,0))","v":""},"-",null,""]
[null,{"$f":"Colab!B39","v":0},{"$f":"Colab!C39","v":0},null,null,{"$f":"IF(H39=\"-\",\"\",VLOOKUP(H39,Config!$A$1:$C$9,2,0))","v":""},{"$f":"IF(H39=\"-\",\"\",VLOOKUP(H39,Config!$A$1:$C$9,3,0))","v":""},"-",null,""]
[null,{"$f":"Colab!B40","v":0},{"$f":"Colab!C40","v":0},null,null,{"$f":"IF(H40=\"-\",\"\",VLOOKUP(H40,Config!$A$1:$C$9,2,0))","v":""},{"$f":"IF(H40=\"-\",\"\",VLOOKUP(H40,Config!$A$1:$C$9,3,0))","v":""},"-",null,""]
[null,{"$f":"Colab!B41","v":0},{"$f":"Colab!C41","v":0},null,null,{"$f":"IF(H41=\"-\",\"\",VLOOKUP(H41,Config!$A$1:$C$9,2,0))","v":""},{"$f":"IF(H41=\"-\",\"\",VLOOKUP(H41,Config!$A$1:$C$9,3,0))","v":""},"-",null,""]
[null,{"$f":"Colab!B42","v":0},{"$f":"Colab!C42","v":0},null,null,{"$f":"IF(H42=\"-\",\"\",VLOOKUP(H42,Config!$A$1:$C$9,2,0))","v":""},{"$f":"IF(H42=\"-\",\"\",VLOOKUP(H42,Config!$A$1:$C$9,3,0))","v":""},"-",null,""]
[null,{"$f":"Colab!B43","v":0},{"$f":"Colab!C43","v":0},null,null,{"$f":"IF(H43=\"-\",\"\",VLOOKUP(H43,Config!$A$1:$C$9,2,0))","v":""},{"$f":"IF(H43=\"-\",\"\",VLOOKUP(H43,Config!$A$1:$C$9,3,0))","v":""},"-",null,""]
[null,{"$f":"Colab!B44","v":0},{"$f":"Colab!C44","v":0},null,null,{"$f":"IF(H44=\"-\",\"\",VLOOKUP(H44,Config!$A$1:$C$9,2,0))","v":""},{"$f":"IF(H44=\"-\",\"\",VLOOKUP(H44,Config!$A$1:$C$9,3,0))","v":""},"-",null,""]
[null,{"$f":"Colab!B45","v":0},{"$f":"Colab!C45","v":0},null,null,{"$f":"IF(H45=\"-\",\"\",VLOOKUP(H45,Config!$A$1:$C$9,2,0))","v":""},{"$f":"IF(H45=\"-\",\"\",VLOOKUP(H45,Config!$A$1:$C$9,3,0))","v":""},"-",null,""]
[null,{"$f":"Colab!B46","v":0},{"$f":"Colab!C46","v":0},null,null,{"$f":"IF(H46=\"-\",\"\",VLOOKUP(H46,Config!$A$1:$C$9,2,0))","v":""},{"$f":"IF(H46=\"-\",\"\",VLOOKUP(H46,Config!$A$1:$C$9,3,0))","v":""},"-",null,{"$f":"IFERROR(AVERAGEIF(C46:G46,\">0\"),\"\")","v":""}]
[null,{"$f":"Colab!B47","v":0},{"$f":"Colab!C47","v":0},null,null,{"$f":"IF(H47=\"-\",\"\",VLOOKUP(H47,Config!$A$1:$C$9,2,0))","v":""},{"$f":"IF(H47=\"-\",\"\",VLOOKUP(H47,Config!$A$1:$C$9,3,0))","v":""},"-",null,""]
[null,{"$f":"Colab!B48","v":0},{"$f":"Colab!C48","v":0},null,null,{"$f":"IF(H48=\"-\",\"\",VLOOKUP(H48,Config!$A$1:$C$9,2,0))","v":""},{"$f":"IF(H48=\"-\",\"\",VLOOKUP(H48,Config!$A$1:$C$9,3,0))","v":""},"-",null,""]
[null,{"$f":"Colab!B49","v":0},{"$f":"Colab!C49","v":0},null,null,{"$f":"IF(H49=\"-\",\"\",VLOOKUP(H49,Config!$A$1:$C$9,2,0))","v":""},{"$f":"IF(H49=\"-\",\"\",VLOOKUP(H49,Config!$A$1:$C$9,3,0))","v":""},"-",null,""]
[null,{"$f":"Colab!B50","v":0},{"$f":"Colab!C50","v":0},null,null,{"$f":"IF(H50=\"-\",\"\",VLOOKUP(H50,Config!$A$1:$C$9,2,0))","v":""},{"$f":"IF(H50=\"-\",\"\",VLOOKUP(H50,Config!$A$1:$C$9,3,0))","v":""},"-",null,""]
[null,{"$f":"Colab!B51","v":0},{"$f":"Colab!C51","v":0},null,null,{"$f":"IF(H51=\"-\",\"\",VLOOKUP(H51,Config!$A$1:$C$9,2,0))","v":""},{"$f":"IF(H51=\"-\",\"\",VLOOKUP(H51,Config!$A$1:$C$9,3,0))","v":""},"-",null,""]
[null,{"$f":"Colab!B52","v":0},{"$f":"Colab!C52","v":0},null,null,{"$f":"IF(H52=\"-\",\"\",VLOOKUP(H52,Config!$A$1:$C$9,2,0))","v":""},{"$f":"IF(H52=\"-\",\"\",VLOOKUP(H52,Config!$A$1:$C$9,3,0))","v":""},"-",null,""]
[null,{"$f":"Colab!B53","v":0},{"$f":"Colab!C53","v":0},null,null,{"$f":"IF(H53=\"-\",\"\",VLOOKUP(H53,Config!$A$1:$C$9,2,0))","v":""},{"$f":"IF(H53=\"-\",\"\",VLOOKUP(H53,Config!$A$1:$C$9,3,0))","v":""},"-",null,""]
[null,{"$f":"Colab!B54","v":0},{"$f":"Colab!C54","v":0},null,null,{"$f":"IF(H54=\"-\",\"\",VLOOKUP(H54,Config!$A$1:$C$9,2,0))","v":""},{"$f":"IF(H54=\"-\",\"\",VLOOKUP(H54,Config!$A$1:$C$9,3,0))","v":""},"-",null,""]
[null,{"$f":"Colab!B55","v":0},{"$f":"Colab!C55","v":0},null,null,{"$f":"IF(H55=\"-\",\"\",VLOOKUP(H55,Config!$A$1:$C$9,2,0))","v":""},{"$f":"IF(H55=\"-\",\"\",VLOOKUP(H55,Config!$A$1:$C$9,3,0))","v":""},"-",null,""]
[null,{"$f":"Colab!B56","v":0},{"$f":"Colab!C56","v":0},null,null,{"$f":"IF(H56=\"-\",\"\",VLOOKUP(H56,Config!$A$1:$C$9,2,0))","v":""},{"$f":"IF(H56=\"-\",\"\",VLOOKUP(H56,Config!$A$1:$C$9,3,0))","v":""},"-",null,""]
[null,{"$f":"Colab!B57","v":0},{"$f":"Colab!C57","v":0},null,null,{"$f":"IF(H57=\"-\",\"\",VLOOKUP(H57,Config!$A$1:$C$9,2,0))","v":""},{"$f":"IF(H57=\"-\",\"\",VLOOKUP(H57,Config!$A$1:$C$9,3,0))","v":""},"-",null,""]
[null,{"$f":"Colab!B58","v":0},{"$f":"Colab!C58","v":0},null,null,{"$f":"IF(H58=\"-\",\"\",VLOOKUP(H58,Config!$A$1:$C$9,2,0))","v":""},{"$f":"IF(H58=\"-\",\"\",VLOOKUP(H58,Config!$A$1:$C$9,3,0))","v":""},"-",null,""]
[null,{"$f":"Colab!B59","v":0},{"$f":"Colab!C59","v":0},null,null,{"$f":"IF(H59=\"-\",\"\",VLOOKUP(H59,Config!$A$1:$C$9,2,0))","v":""},{"$f":"IF(H59=\"-\",\"\",VLOOKUP(H59,Config!$A$1:$C$9,3,0))","v":""},"-",null,""]
[null,{"$f":"Colab!B60","v":0},{"$f":"Colab!C60","v":0},null,null,{"$f":"IF(H60=\"-\",\"\",VLOOKUP(H60,Config!$A$1:$C$9,2,0))","v":""},{"$f":"IF(H60=\"-\",\"\",VLOOKUP(H60,Config!$A$1:$C$9,3,0))","v":""},"-",null,""]
[null,{"$f":"Colab!B61","v":0},{"$f":"Colab!C61","v":0},null,null,{"$f":"IF(H61=\"-\",\"\",VLOOKUP(H61,Config!$A$1:$C$9,2,0))","v":""},{"$f":"IF(H61=\"-\",\"\",VLOOKUP(H61,Config!$A$1:$C$9,3,0))","v":""},"-",null,""]
[null,{"$f":"Colab!B62","v":0},{"$f":"Colab!C62","v":0},null,null,{"$f":"IF(H62=\"-\",\"\",VLOOKUP(H62,Config!$A$1:$C$9,2,0))","v":""},{"$f":"IF(H62=\"-\",\"\",VLOOKUP(H62,Config!$A$1:$C$9,3,0))","v":""},"-",null,""]
[null,{"$f":"Colab!B63","v":0},{"$f":"Colab!C63","v":0},null,null,{"$f":"IF(H63=\"-\",\"\",VLOOKUP(H63,Config!$A$1:$C$9,2,0))","v":""},{"$f":"IF(H63=\"-\",\"\",VLOOKUP(H63,Config!$A$1:$C$9,3,0))","v":""},"-",null,""]

{"sheet":"Dash1","index":4,"n_rows":29,"n_cols":9,"rows_kept":29,"cut":false,"hidden":false,"merged":[[10,4,10,9],[14,4,16,5],[14,6,16,7],[14,8,16,9],[18,8,20,9],[18,6,20,7],[18,4,20,5],[28,4,28,9],[26,4,26,5],[26,6,26,7],[26,8,26,9],[22,3,25,3],[25,8,25,9],[25,6,25,7],[25,4,25,5],[22,4,24,5],[22,6,24,7],[22,8,24,9],[18,3,21,3],[14,3,17,3],[27,4,27,9],[14,2,25,2],[14,1,25,1],[17,4,17,5],[17,6,17,7],[17,8,17,9],[21,4,21,5],[21,6,21,7],[21,8,21,9]]}
[]
[]
[]
[]
[]
[]
[]
[]
[]
[]
[null,"Empresa:",null,null,{"$f":"Menu!G26","v":"Empresa ABCDE"}]
[]
[]
[]
[null,"POTENCIAL","Modelo de Competência","Alto",{"$f":"COUNTIF(Avaliação!$F$14:$F$63,Dash1!E18)","v":0},null,{"$f":"COUNTIFS(Avaliação!$F$14:$F$63,Dash1!G18,Avaliação!$E$14:$E$63,\"Alto\")","v":1},null,{"$f":"COUNTIF(Avaliação!$F$14:$F$63,Dash1!I18)","v":1}]
[]
[]
[null,null,null,null,"Diamente Bruto",null,"Forte Desempenho",null,"Alto Potencial"]
[null,null,null,"Médio",{"$f":"COUNTIF(Avaliação!$F$14:$F$63,Dash1!E22)","v":0},null,{"$f":"COUNTIF(Avaliação!$F$14:$F$63,Dash1!G22)","v":0},null,{"$f":"COUNTIFS(Avaliação!$F$14:$F$63,Dash1!I22,Avaliação!$E$14:$E$63,\"Médio\")","v":0}]
[]
[]
[null,null,null,null,"Questionável",null,"Mantenedor",null,"Forte Desempenho"]
[null,null,null,"Baixo",{"$f":"COUNTIF(Avaliação!$F$14:$F$63,Dash1!E26)","v":1},null,{"$f":"COUNTIF(Avaliação!$F$14:$F$63,Dash1!G26)","v":0},null,{"$f":"COUNTIF(Avaliação!$F$14:$F$63,Dash1!I26)","v":0}]
[]
[]
[null,null,null,null,"Insuficiente",null,"Eficaz",null,"Comprometido"]
[null,null,null,null,"Abaixo do Esperado",null,"Esperado",null,"Acima do Esperado"]
[null,null,null,null,"DESEMPENHO"]
[null,null,null,null,"Cumprimento dos Objetivos"]

{"sheet":"Dash2","index":5,"n_rows":29,"n_cols":9,"rows_kept":29,"cut":false,"hidden":false,"merged":[[28,4,28,9],[10,4,10,9],[12,4,12,9],[22,8,24,9],[25,4,25,5],[25,6,25,7],[25,8,25,9],[26,4,26,5],[26,6,26,7],[26,8,26,9],[17,4,17,5],[17,6,17,7],[17,8,17,9],[14,8,16,9],[18,8,20,9],[21,4,21,5],[21,6,21,7],[21,8,21,9],[27,4,27,9],[14,1,25,1],[14,2,25,2],[14,3,17,3],[14,4,16,5],[14,6,16,7],[22,3,25,3],[22,4,24,5],[22,6,24,7],[18,3,21,3],[18,4,20,5],[18,6,20,7]]}
[]
[]
[]
[]
[]
[]
[]
[]
[]
[]
[null,"Empresa:",null,null,{"$f":"Menu!G26","v":"Empresa ABCDE"}]
[]
[null,"Área:",null,null,"Produção"]
[]
[null,"POTENCIAL","Modelo de Competência","Alto",{"$f":"COUNTIFS(Avaliação!$F$14:$F$63,Dash2!E18,Avaliação!$C$14:$C$63,$E$13)","v":0},null,{"$f":"COUNTIFS(Avaliação!$F$14:$F$63,Dash1!G18,Avaliação!$E$14:$E$63,\"Alto\",Avaliação!$C$14:$C$63,$E$13)","v":0},null,{"$f":"COUNTIFS(Avaliação!$F$14:$F$63,Dash2!I18,Avaliação!$C$14:$C$63,$E$13)","v":1}]
[]
[]
[null,null,null,null,"Diamente Bruto",null,"Forte Desempenho",null,"Alto Potencial"]
[null,null,null,"Médio",{"$f":"COUNTIFS(Avaliação!$F$14:$F$63,Dash2!E22,Avaliação!$C$14:$C$63,$E$13)","v":0},null,{"$f":"COUNTIFS(Avaliação!$F$14:$F$63,Dash2!G22,Avaliação!$C$14:$C$63,$E$13)","v":0},null,{"$f":"COUNTIFS(Avaliação!$F$14:$F$63,Dash1!I22,Avaliação!$E$14:$E$63,\"Médio\",Avaliação!$C$14:$C$63,$E$13)","v":0}]
[]
[]
[null,null,null,null,"Questionável",null,"Mantenedor",null,"Forte Desempenho"]
[null,null,null,"Baixo",{"$f":"COUNTIFS(Avaliação!$F$14:$F$63,Dash2!E26,Avaliação!$C$14:$C$63,$E$13)","v":0},null,{"$f":"COUNTIFS(Avaliação!$F$14:$F$63,Dash2!G26,Avaliação!$C$14:$C$63,$E$13)","v":0},null,{"$f":"COUNTIFS(Avaliação!$F$14:$F$63,Dash2!I26,Avaliação!$C$14:$C$63,$E$13)","v":0}]
[]
[]
[null,null,null,null,"Insuficiente",null,"Eficaz",null,"Comprometido"]
[null,null,null,null,"Abaixo do Esperado",null,"Esperado",null,"Acima do Esperado"]
[null,null,null,null,"DESEMPENHO"]
[null,null,null,null,"Cumprimento dos Objetivos"]

{"sheet":"Dash3","index":6,"n_rows":29,"n_cols":9,"rows_kept":29,"cut":false,"hidden":false,"merged":[[28,4,28,9],[10,4,10,9],[12,5,12,9],[22,8,24,9],[25,4,25,5],[25,6,25,7],[25,8,25,9],[26,4,26,5],[26,6,26,7],[26,8,26,9],[17,4,17,5],[17,6,17,7],[17,8,17,9],[14,8,16,9],[18,8,20,9],[21,4,21,5],[21,6,21,7],[21,8,21,9],[27,4,27,9],[14,1,25,1],[14,2,25,2],[14,3,17,3],[14,4,16,5],[14,6,16,7],[22,3,25,3],[22,4,24,5],[22,6,24,7],[18,3,21,3],[18,4,20,5],[18,6,20,7]]}
[]
[]
[]
[]
[]
[]
[]
[]
[]
[]
[null,"Empresa:",null,null,{"$f":"Menu!G26","v":"Empresa ABCDE"}]
[]
[null,"Colaborador:",null,null,null,"Paulo Vitor"]
[]
[null,"POTENCIAL","Modelo de Competência","Alto",{"$f":"COUNTIFS(Avaliação!$F$14:$F$63,E18,Avaliação!$B$14:$B$63,$F$13)","v":0},null,{"$f":"COUNTIFS(Avaliação!$F$14:$F$63,Dash3!G18,Avaliação!$E$14:$E$63,\"Alto\",Avaliação!$B$14:$B$63,$F$13)","v":0},null,{"$f":"COUNTIFS(Avaliação!$F$14:$F$63,I18,Avaliação!$B$14:$B$63,$F$13)","v":0}]
[]
[]
[null,null,null,null,"Diamente Bruto",null,"Forte Desempenho",null,"Alto Potencial"]
[null,null,null,"Médio",{"$f":"COUNTIFS(Avaliação!$F$14:$F$63,E22,Avaliação!$B$14:$B$63,$F$13)","v":0},null,{"$f":"COUNTIFS(Avaliação!$F$14:$F$63,G22,Avaliação!$B$14:$B$63,$F$13)","v":0},null,{"$f":"COUNTIFS(Avaliação!$F$14:$F$63,Dash3!I22,Avaliação!$E$14:$E$63,\"Médio\",Avaliação!$B$14:$B$63,$F$13)","v":0}]
[]
[]
[null,null,null,null,"Questionável",null,"Mantenedor",null,"Forte Desempenho"]
[null,null,null,"Baixo",{"$f":"COUNTIFS(Avaliação!$F$14:$F$63,E26,Avaliação!$B$14:$B$63,$F$13)","v":1},null,{"$f":"COUNTIFS(Avaliação!$F$14:$F$63,G26,Avaliação!$B$14:$B$63,$F$13)","v":0},null,{"$f":"COUNTIFS(Avaliação!$F$14:$F$63,I26,Avaliação!$B$14:$B$63,$F$13)","v":0}]
[]
[]
[null,null,null,null,"Insuficiente",null,"Eficaz",null,"Comprometido"]
[null,null,null,null,"Abaixo do Esperado",null,"Esperado",null,"Acima do Esperado"]
[null,null,null,null,"DESEMPENHO"]
[null,null,null,null,"Cumprimento dos Objetivos"]

{"sheet":"Instruções","index":7,"n_rows":0,"n_cols":0,"rows_kept":0,"cut":false,"hidden":false,"merged":[]}

{"sheet":"Config","index":8,"n_rows":9,"n_cols":8,"rows_kept":9,"cut":false,"hidden":false,"merged":[]}
["Esperado-Baixo","Eficaz","Testar novas funções, pode estar desmotivado.",null,null,null,null,"Analfabeto"]
["Esperado-Médio","Mantenedor","Está bem na função atual. Investir em capacitação para aumentar o desempenho.",null,null,null,null,"Ensino Fundamental"]
["Esperado-Alto","Forte Desempenho","Verificar se tem habilidades para administrar projetos a longo prazo.",null,null,null,null,"Ensino Médio"]
["Abaixo do Esperado-Baixo","Insuficiente","Função exigem mais que suas habilidades. Analisar demissão ou cargo de menor responsabilidades.",null,null,null,null,"Ensino Superior"]
["Abaixo do Esperado-Médio","Questionável","Pode estar na área errada. Testar novas atribuições.",null,null,null,null,"Pós Graduado"]
["Abaixo do Esperado-Alto","Diamante Bruto","Tem potencial, mas pode estar mau aproveitado na área."]
["Acima do Esperado-Baixo","Comprometido","Está bem na função atual. Verificar remuneração e manter no cargo atual."]
["Acima do Esperado-Médio","Forte Desempenho","Tem potencial de liderança. Analisar possibilidade de pequenas promoções internas."]
["Acima do Esperado-Alto","Alto Potencial","Grande potencial. Pode delegar mais responsabilidades."]